Skip to forum content

You are not logged in. Please login or register.


forums.pvpgn.pro → [RU] The Source Code → visual studio build errors

Pages 1

You must login or register to post a reply

RSS topic feed

Posts: 12

1

Topic: visual studio build errors

1>------ Rebuild All started: Project: ZERO_CHECK, Configuration: Release Win32 ------
1>C:\Program Files\MSBuild\Microsoft.Cpp\v4.0\Microsoft.CppBuild.targets(806,5): error MSB3191: Unable to create directory "F:\Ghost ++\PVPGN-SERVER\build\CMakeFiles\". Could not find a part of the path 'F:\Ghost ++\PVPGN-SERVER\build\CMakeFiles\'.
1>C:\Program Files\MSBuild\Microsoft.Cpp\v4.0\Microsoft.CppBuild.targets(806,5): error MSB3191: Unable to create directory "F:\Ghost ++\PVPGN-SERVER\build\src\CMakeFiles\". Could not find a part of the path 'F:\Ghost ++\PVPGN-SERVER\build\src\CMakeFiles\'.
1>C:\Program Files\MSBuild\Microsoft.Cpp\v4.0\Microsoft.CppBuild.targets(806,5): error MSB3191: Unable to create directory "F:\Ghost ++\PVPGN-SERVER\build\conf\CMakeFiles\". Could not find a part of the path 'F:\Ghost ++\PVPGN-SERVER\build\conf\CMakeFiles\'.
1>C:\Program Files\MSBuild\Microsoft.Cpp\v4.0\Microsoft.CppBuild.targets(806,5): error MSB3191: Unable to create directory "F:\Ghost ++\PVPGN-SERVER\build\man\CMakeFiles\". Could not find a part of the path 'F:\Ghost ++\PVPGN-SERVER\build\man\CMakeFiles\'.
1>C:\Program Files\MSBuild\Microsoft.Cpp\v4.0\Microsoft.CppBuild.targets(806,5): error MSB3191: Unable to create directory "F:\Ghost ++\PVPGN-SERVER\build\files\CMakeFiles\". Could not find a part of the path 'F:\Ghost ++\PVPGN-SERVER\build\files\CMakeFiles\'.
1>C:\Program Files\MSBuild\Microsoft.Cpp\v4.0\Microsoft.CppBuild.targets(806,5): error MSB3191: Unable to create directory "F:\Ghost ++\PVPGN-SERVER\build\src\compat\CMakeFiles\". Could not find a part of the path 'F:\Ghost ++\PVPGN-SERVER\build\src\compat\CMakeFiles\'.
1>C:\Program Files\MSBuild\Microsoft.Cpp\v4.0\Microsoft.CppBuild.targets(806,5): error MSB3191: Unable to create directory "F:\Ghost ++\PVPGN-SERVER\build\src\common\CMakeFiles\". Could not find a part of the path 'F:\Ghost ++\PVPGN-SERVER\build\src\common\CMakeFiles\'.
1>C:\Program Files\MSBuild\Microsoft.Cpp\v4.0\Microsoft.CppBuild.targets(806,5): error MSB3191: Unable to create directory "F:\Ghost ++\PVPGN-SERVER\build\src\win32\CMakeFiles\". Could not find a part of the path 'F:\Ghost ++\PVPGN-SERVER\build\src\win32\CMakeFiles\'.
1>C:\Program Files\MSBuild\Microsoft.Cpp\v4.0\Microsoft.CppBuild.targets(806,5): error MSB3191: Unable to create directory "F:\Ghost ++\PVPGN-SERVER\build\src\tinycdb\CMakeFiles\". Could not find a part of the path 'F:\Ghost ++\PVPGN-SERVER\build\src\tinycdb\CMakeFiles\'.
1>C:\Program Files\MSBuild\Microsoft.Cpp\v4.0\Microsoft.CppBuild.targets(806,5): error MSB3191: Unable to create directory "F:\Ghost ++\PVPGN-SERVER\build\src\bntrackd\CMakeFiles\". Could not find a part of the path 'F:\Ghost ++\PVPGN-SERVER\build\src\bntrackd\CMakeFiles\'.
1>C:\Program Files\MSBuild\Microsoft.Cpp\v4.0\Microsoft.CppBuild.targets(806,5): error MSB3191: Unable to create directory "F:\Ghost ++\PVPGN-SERVER\build\src\client\CMakeFiles\". Could not find a part of the path 'F:\Ghost ++\PVPGN-SERVER\build\src\client\CMakeFiles\'.
1>C:\Program Files\MSBuild\Microsoft.Cpp\v4.0\Microsoft.CppBuild.targets(806,5): error MSB3191: Unable to create directory "F:\Ghost ++\PVPGN-SERVER\build\src\bniutils\CMakeFiles\". Could not find a part of the path 'F:\Ghost ++\PVPGN-SERVER\build\src\bniutils\CMakeFiles\'.
1>C:\Program Files\MSBuild\Microsoft.Cpp\v4.0\Microsoft.CppBuild.targets(806,5): error MSB3191: Unable to create directory "F:\Ghost ++\PVPGN-SERVER\build\src\bnpass\CMakeFiles\". Could not find a part of the path 'F:\Ghost ++\PVPGN-SERVER\build\src\bnpass\CMakeFiles\'.
1>C:\Program Files\MSBuild\Microsoft.Cpp\v4.0\Microsoft.CppBuild.targets(806,5): error MSB3191: Unable to create directory "F:\Ghost ++\PVPGN-SERVER\build\src\bnetd\CMakeFiles\". Could not find a part of the path 'F:\Ghost ++\PVPGN-SERVER\build\src\bnetd\CMakeFiles\'.
1>C:\Program Files\MSBuild\Microsoft.Cpp\v4.0\Microsoft.CppBuild.targets(806,5): error MSB3191: Unable to create directory "F:\Ghost ++\PVPGN-SERVER\build\src\d2cs\CMakeFiles\". Could not find a part of the path 'F:\Ghost ++\PVPGN-SERVER\build\src\d2cs\CMakeFiles\'.
1>C:\Program Files\MSBuild\Microsoft.Cpp\v4.0\Microsoft.CppBuild.targets(806,5): error MSB3191: Unable to create directory "F:\Ghost ++\PVPGN-SERVER\build\src\d2dbs\CMakeFiles\". Could not find a part of the path 'F:\Ghost ++\PVPGN-SERVER\build\src\d2dbs\CMakeFiles\'.
1>C:\Program Files\MSBuild\Microsoft.Cpp\v4.0\Microsoft.CppBuild.targets(806,5): error MSB3191: Unable to create directory "F:\Ghost ++\PVPGN-SERVER\build\src\test\CMakeFiles\". Could not find a part of the path 'F:\Ghost ++\PVPGN-SERVER\build\src\test\CMakeFiles\'.
2>------ Rebuild All started: Project: tinycdb, Configuration: Release Win32 ------
3>------ Rebuild All started: Project: compat, Configuration: Release Win32 ------
4>------ Rebuild All started: Project: common, Configuration: Release Win32 ------
5>------ Rebuild All started: Project: win32, Configuration: Release Win32 ------
2>C:\Windows\Microsoft.NET\Framework\v4.0.30319\Microsoft.Common.Targets(1422,5): warning : The referenced project 'F:/Ghost ++/PVPGN-SERVER/build/ZERO_CHECK.vcxproj' does not exist.
2>C:\Program Files\MSBuild\Microsoft.Cpp\v4.0\Microsoft.CppBuild.targets(301,6): error MSB3191: Unable to create directory "F:\Ghost ++\PVPGN-SERVER\build\src\tinycdb\Release\". Could not find a part of the path 'F:\Ghost ++\PVPGN-SERVER\build\src\tinycdb\Release\'.
3>C:\Windows\Microsoft.NET\Framework\v4.0.30319\Microsoft.Common.Targets(1422,5): warning : The referenced project 'F:/Ghost ++/PVPGN-SERVER/build/ZERO_CHECK.vcxproj' does not exist.
3>C:\Program Files\MSBuild\Microsoft.Cpp\v4.0\Microsoft.CppBuild.targets(301,6): error MSB3191: Unable to create directory "F:\Ghost ++\PVPGN-SERVER\build\src\compat\Release\". Could not find a part of the path 'F:\Ghost ++\PVPGN-SERVER\build\src\compat\Release\'.
4>C:\Windows\Microsoft.NET\Framework\v4.0.30319\Microsoft.Common.Targets(1422,5): warning : The referenced project 'F:/Ghost ++/PVPGN-SERVER/build/ZERO_CHECK.vcxproj' does not exist.
4>C:\Program Files\MSBuild\Microsoft.Cpp\v4.0\Microsoft.CppBuild.targets(301,6): error MSB3191: Unable to create directory "F:\Ghost ++\PVPGN-SERVER\build\src\common\Release\". Could not find a part of the path 'F:\Ghost ++\PVPGN-SERVER\build\src\common\Release\'.
5>C:\Windows\Microsoft.NET\Framework\v4.0.30319\Microsoft.Common.Targets(1422,5): warning : The referenced project 'F:/Ghost ++/PVPGN-SERVER/build/ZERO_CHECK.vcxproj' does not exist.
5>C:\Program Files\MSBuild\Microsoft.Cpp\v4.0\Microsoft.CppBuild.targets(301,6): error MSB3191: Unable to create directory "F:\Ghost ++\PVPGN-SERVER\build\src\win32\Release\". Could not find a part of the path 'F:\Ghost ++\PVPGN-SERVER\build\src\win32\Release\'.
6>------ Rebuild All started: Project: bnetd, Configuration: Release Win32 ------
6>C:\Windows\Microsoft.NET\Framework\v4.0.30319\Microsoft.Common.Targets(1422,5): warning : The referenced project 'F:/Ghost ++/PVPGN-SERVER/build/ZERO_CHECK.vcxproj' does not exist.
6>C:\Windows\Microsoft.NET\Framework\v4.0.30319\Microsoft.Common.Targets(1422,5): warning : The referenced project 'F:/Ghost ++/PVPGN-SERVER/build/src/common/common.vcxproj' does not exist.
6>C:\Windows\Microsoft.NET\Framework\v4.0.30319\Microsoft.Common.Targets(1422,5): warning : The referenced project 'F:/Ghost ++/PVPGN-SERVER/build/src/compat/compat.vcxproj' does not exist.
6>C:\Windows\Microsoft.NET\Framework\v4.0.30319\Microsoft.Common.Targets(1422,5): warning : The referenced project 'F:/Ghost ++/PVPGN-SERVER/build/src/tinycdb/tinycdb.vcxproj' does not exist.
6>C:\Windows\Microsoft.NET\Framework\v4.0.30319\Microsoft.Common.Targets(1422,5): warning : The referenced project 'F:/Ghost ++/PVPGN-SERVER/build/src/win32/win32.vcxproj' does not exist.
6>C:\Program Files\MSBuild\Microsoft.Cpp\v4.0\Microsoft.CppBuild.targets(301,6): error MSB3191: Unable to create directory "F:\Ghost ++\PVPGN-SERVER\build\src\bnetd\Release\". Could not find a part of the path 'F:\Ghost ++\PVPGN-SERVER\build\src\bnetd\Release\'.
========== Rebuild All: 0 succeeded, 6 failed, 0 skipped ==========

как решить

2

Re: visual studio build errors

CMake не поддерживает пробелы в пути. Желательно чтобы проект был по пути из папок, содержащих латиницу в имени и без специальных символов.

Do not ask for support in PM.

3

Re: visual studio build errors

launcher wrote:
1>------ Rebuild All started: Project: ZERO_CHECK, Configuration: Release Win32 ------
1>C:\Program Files\MSBuild\Microsoft.Cpp\v4.0\Microsoft.CppBuild.targets(806,5): error MSB3191: Unable to create directory "F:\Ghost ++\PVPGN-SERVER\build\CMakeFiles\". Could not find a part of the path 'F:\Ghost ++\PVPGN-SERVER\build\CMakeFiles\'.
1>C:\Program Files\MSBuild\Microsoft.Cpp\v4.0\Microsoft.CppBuild.targets(806,5): error MSB3191: Unable to create directory "F:\Ghost ++\PVPGN-SERVER\build\src\CMakeFiles\". Could not find a part of the path 'F:\Ghost ++\PVPGN-SERVER\build\src\CMakeFiles\'.
1>C:\Program Files\MSBuild\Microsoft.Cpp\v4.0\Microsoft.CppBuild.targets(806,5): error MSB3191: Unable to create directory "F:\Ghost ++\PVPGN-SERVER\build\conf\CMakeFiles\". Could not find a part of the path 'F:\Ghost ++\PVPGN-SERVER\build\conf\CMakeFiles\'.
1>C:\Program Files\MSBuild\Microsoft.Cpp\v4.0\Microsoft.CppBuild.targets(806,5): error MSB3191: Unable to create directory "F:\Ghost ++\PVPGN-SERVER\build\man\CMakeFiles\". Could not find a part of the path 'F:\Ghost ++\PVPGN-SERVER\build\man\CMakeFiles\'.
1>C:\Program Files\MSBuild\Microsoft.Cpp\v4.0\Microsoft.CppBuild.targets(806,5): error MSB3191: Unable to create directory "F:\Ghost ++\PVPGN-SERVER\build\files\CMakeFiles\". Could not find a part of the path 'F:\Ghost ++\PVPGN-SERVER\build\files\CMakeFiles\'.
1>C:\Program Files\MSBuild\Microsoft.Cpp\v4.0\Microsoft.CppBuild.targets(806,5): error MSB3191: Unable to create directory "F:\Ghost ++\PVPGN-SERVER\build\src\compat\CMakeFiles\". Could not find a part of the path 'F:\Ghost ++\PVPGN-SERVER\build\src\compat\CMakeFiles\'.
1>C:\Program Files\MSBuild\Microsoft.Cpp\v4.0\Microsoft.CppBuild.targets(806,5): error MSB3191: Unable to create directory "F:\Ghost ++\PVPGN-SERVER\build\src\common\CMakeFiles\". Could not find a part of the path 'F:\Ghost ++\PVPGN-SERVER\build\src\common\CMakeFiles\'.
1>C:\Program Files\MSBuild\Microsoft.Cpp\v4.0\Microsoft.CppBuild.targets(806,5): error MSB3191: Unable to create directory "F:\Ghost ++\PVPGN-SERVER\build\src\win32\CMakeFiles\". Could not find a part of the path 'F:\Ghost ++\PVPGN-SERVER\build\src\win32\CMakeFiles\'.
1>C:\Program Files\MSBuild\Microsoft.Cpp\v4.0\Microsoft.CppBuild.targets(806,5): error MSB3191: Unable to create directory "F:\Ghost ++\PVPGN-SERVER\build\src\tinycdb\CMakeFiles\". Could not find a part of the path 'F:\Ghost ++\PVPGN-SERVER\build\src\tinycdb\CMakeFiles\'.
1>C:\Program Files\MSBuild\Microsoft.Cpp\v4.0\Microsoft.CppBuild.targets(806,5): error MSB3191: Unable to create directory "F:\Ghost ++\PVPGN-SERVER\build\src\bntrackd\CMakeFiles\". Could not find a part of the path 'F:\Ghost ++\PVPGN-SERVER\build\src\bntrackd\CMakeFiles\'.
1>C:\Program Files\MSBuild\Microsoft.Cpp\v4.0\Microsoft.CppBuild.targets(806,5): error MSB3191: Unable to create directory "F:\Ghost ++\PVPGN-SERVER\build\src\client\CMakeFiles\". Could not find a part of the path 'F:\Ghost ++\PVPGN-SERVER\build\src\client\CMakeFiles\'.
1>C:\Program Files\MSBuild\Microsoft.Cpp\v4.0\Microsoft.CppBuild.targets(806,5): error MSB3191: Unable to create directory "F:\Ghost ++\PVPGN-SERVER\build\src\bniutils\CMakeFiles\". Could not find a part of the path 'F:\Ghost ++\PVPGN-SERVER\build\src\bniutils\CMakeFiles\'.
1>C:\Program Files\MSBuild\Microsoft.Cpp\v4.0\Microsoft.CppBuild.targets(806,5): error MSB3191: Unable to create directory "F:\Ghost ++\PVPGN-SERVER\build\src\bnpass\CMakeFiles\". Could not find a part of the path 'F:\Ghost ++\PVPGN-SERVER\build\src\bnpass\CMakeFiles\'.
1>C:\Program Files\MSBuild\Microsoft.Cpp\v4.0\Microsoft.CppBuild.targets(806,5): error MSB3191: Unable to create directory "F:\Ghost ++\PVPGN-SERVER\build\src\bnetd\CMakeFiles\". Could not find a part of the path 'F:\Ghost ++\PVPGN-SERVER\build\src\bnetd\CMakeFiles\'.
1>C:\Program Files\MSBuild\Microsoft.Cpp\v4.0\Microsoft.CppBuild.targets(806,5): error MSB3191: Unable to create directory "F:\Ghost ++\PVPGN-SERVER\build\src\d2cs\CMakeFiles\". Could not find a part of the path 'F:\Ghost ++\PVPGN-SERVER\build\src\d2cs\CMakeFiles\'.
1>C:\Program Files\MSBuild\Microsoft.Cpp\v4.0\Microsoft.CppBuild.targets(806,5): error MSB3191: Unable to create directory "F:\Ghost ++\PVPGN-SERVER\build\src\d2dbs\CMakeFiles\". Could not find a part of the path 'F:\Ghost ++\PVPGN-SERVER\build\src\d2dbs\CMakeFiles\'.
1>C:\Program Files\MSBuild\Microsoft.Cpp\v4.0\Microsoft.CppBuild.targets(806,5): error MSB3191: Unable to create directory "F:\Ghost ++\PVPGN-SERVER\build\src\test\CMakeFiles\". Could not find a part of the path 'F:\Ghost ++\PVPGN-SERVER\build\src\test\CMakeFiles\'.
2>------ Rebuild All started: Project: tinycdb, Configuration: Release Win32 ------
3>------ Rebuild All started: Project: compat, Configuration: Release Win32 ------
4>------ Rebuild All started: Project: common, Configuration: Release Win32 ------
5>------ Rebuild All started: Project: win32, Configuration: Release Win32 ------
2>C:\Windows\Microsoft.NET\Framework\v4.0.30319\Microsoft.Common.Targets(1422,5): warning : The referenced project 'F:/Ghost ++/PVPGN-SERVER/build/ZERO_CHECK.vcxproj' does not exist.
2>C:\Program Files\MSBuild\Microsoft.Cpp\v4.0\Microsoft.CppBuild.targets(301,6): error MSB3191: Unable to create directory "F:\Ghost ++\PVPGN-SERVER\build\src\tinycdb\Release\". Could not find a part of the path 'F:\Ghost ++\PVPGN-SERVER\build\src\tinycdb\Release\'.
3>C:\Windows\Microsoft.NET\Framework\v4.0.30319\Microsoft.Common.Targets(1422,5): warning : The referenced project 'F:/Ghost ++/PVPGN-SERVER/build/ZERO_CHECK.vcxproj' does not exist.
3>C:\Program Files\MSBuild\Microsoft.Cpp\v4.0\Microsoft.CppBuild.targets(301,6): error MSB3191: Unable to create directory "F:\Ghost ++\PVPGN-SERVER\build\src\compat\Release\". Could not find a part of the path 'F:\Ghost ++\PVPGN-SERVER\build\src\compat\Release\'.
4>C:\Windows\Microsoft.NET\Framework\v4.0.30319\Microsoft.Common.Targets(1422,5): warning : The referenced project 'F:/Ghost ++/PVPGN-SERVER/build/ZERO_CHECK.vcxproj' does not exist.
4>C:\Program Files\MSBuild\Microsoft.Cpp\v4.0\Microsoft.CppBuild.targets(301,6): error MSB3191: Unable to create directory "F:\Ghost ++\PVPGN-SERVER\build\src\common\Release\". Could not find a part of the path 'F:\Ghost ++\PVPGN-SERVER\build\src\common\Release\'.
5>C:\Windows\Microsoft.NET\Framework\v4.0.30319\Microsoft.Common.Targets(1422,5): warning : The referenced project 'F:/Ghost ++/PVPGN-SERVER/build/ZERO_CHECK.vcxproj' does not exist.
5>C:\Program Files\MSBuild\Microsoft.Cpp\v4.0\Microsoft.CppBuild.targets(301,6): error MSB3191: Unable to create directory "F:\Ghost ++\PVPGN-SERVER\build\src\win32\Release\". Could not find a part of the path 'F:\Ghost ++\PVPGN-SERVER\build\src\win32\Release\'.
6>------ Rebuild All started: Project: bnetd, Configuration: Release Win32 ------
6>C:\Windows\Microsoft.NET\Framework\v4.0.30319\Microsoft.Common.Targets(1422,5): warning : The referenced project 'F:/Ghost ++/PVPGN-SERVER/build/ZERO_CHECK.vcxproj' does not exist.
6>C:\Windows\Microsoft.NET\Framework\v4.0.30319\Microsoft.Common.Targets(1422,5): warning : The referenced project 'F:/Ghost ++/PVPGN-SERVER/build/src/common/common.vcxproj' does not exist.
6>C:\Windows\Microsoft.NET\Framework\v4.0.30319\Microsoft.Common.Targets(1422,5): warning : The referenced project 'F:/Ghost ++/PVPGN-SERVER/build/src/compat/compat.vcxproj' does not exist.
6>C:\Windows\Microsoft.NET\Framework\v4.0.30319\Microsoft.Common.Targets(1422,5): warning : The referenced project 'F:/Ghost ++/PVPGN-SERVER/build/src/tinycdb/tinycdb.vcxproj' does not exist.
6>C:\Windows\Microsoft.NET\Framework\v4.0.30319\Microsoft.Common.Targets(1422,5): warning : The referenced project 'F:/Ghost ++/PVPGN-SERVER/build/src/win32/win32.vcxproj' does not exist.
6>C:\Program Files\MSBuild\Microsoft.Cpp\v4.0\Microsoft.CppBuild.targets(301,6): error MSB3191: Unable to create directory "F:\Ghost ++\PVPGN-SERVER\build\src\bnetd\Release\". Could not find a part of the path 'F:\Ghost ++\PVPGN-SERVER\build\src\bnetd\Release\'.
========== Rebuild All: 0 succeeded, 6 failed, 0 skipped ==========

как решить

скомпилируй с "magic builder"ом там все ошибки будут ясными

4 (edited by launcher 19.08.2016 14:51)

Re: visual studio build errors

я узнал почему выдет такую ошибку. дело в том что раньше диск назывался буквой F а щас стал D
как поменять в исходниках это ??

Добавлено: 19.08.2016 16:58

Heeeelp!

5

Re: visual studio build errors

Проще изменить букву диска в Windows через Управление дисками.

Do not ask for support in PM.

6

Re: visual studio build errors

да проще но там много программ в папках они остаются с D диска.
возможно в исходниках исправить с F на D ??

7

Re: visual studio build errors

В notepad++ есть функция поиска и замены во всех файлах в определенной папке и её подпапках - можно там это сделать.

Do not ask for support in PM.

8

Re: visual studio build errors

значит в build\src .. открыть все папки и файлы и  заменить?? там их дофига файлов yikes

9

Re: visual studio build errors

Не нужно их открывать www.phpsuperblog.com/misc/find-a … h-notepad/

Do not ask for support in PM.

10

Re: visual studio build errors

там нету я не нашел F:/  такого значения

11

Re: visual studio build errors

Наверное потому что в строке "F:\Ghost ++\PVPGN-SERVER\build\src\test\CMakeFiles\" нет сочетания "F:/"

Do not ask for support in PM.

12

Re: visual studio build errors

а через C++ можно поменяь???

Добавлено: 19.08.2016 21:12

решено можете закрыть!

Posts: 12

Pages 1

You must login or register to post a reply

Who now at forum

Currently view post: 1 guest, 0 registered users

forums.pvpgn.pro → [RU] The Source Code → visual studio build errors



Generated in 0.075 seconds (88% PHP - 12% DB) with 20 queries